查看: 6278|回复: 1

tslib编译不成功

11

主题

7

回帖

47

积分

zhangzl892 发表于 2013-4-24 19:50:49 | 显示全部楼层 |阅读模式
出现这样的错误,是什么原因?
s_test.o: In function `main':
ts_test.c:(.text+0x51c): undefined reference to `rpl_malloc'
fbutils.o: In function `open_framebuffer':
fbutils.c:(.text+0xbb4): undefined reference to `rpl_malloc'
collect2: ld returned 1 exit status
make[2]: *** [ts_test] Error 1
make[2]: Leaving directory `/forlinx/tslib/tslib/tests'
make[1]: *** [all-recursive] Error 1
make[1]: Leaving directory `/forlinx/tslib/tslib'
make: *** [all] Error 2
回复

使用道具 举报

97

主题

4053

回帖

4207

积分

AM5718通行证AM335x通行证i.MX6UL通行证i.MX RT通行证i.MX6Q通行证XX18通行证TCU通行证FCU1401通行证FCU1301通行证FCU11xx通行证

飞凌-unix 发表于 2013-4-25 08:24:53 | 显示全部楼层
我们有提供编译好的文件,楼主使用过吗
技术支持电话:0312-3119192
技术支持邮箱:Linux@forlinx.com
点评回复 支持 反对

使用道具 举报

您需要登录后才可以回帖 登录 | 注册

本版积分规则